BDBM50459737 CHEMBL4211204
SMILES CC(C)C[C@H](NC(C)=O)C(=O)N1CCC[C@H]1C(=O)N[C@@H](C(C)C)C(=O)N[C@@H](CN)C(=O)N[C@@H](CC1CCCC1)C(=O)N1CCC[C@H]1c1nc(cn1CC1CCCCC1)-c1ccccc1
InChI Key InChIKey=FNDMXKNPADTRQS-ABMZEFHLSA-N
Data  2 KI  2 IC50
  Tab Delimited (TSV)   2D SDfile   Computed 3D by Vconf -m prep SDfile
Find this compound or compounds like it in BindingDB:
Activity Spreadsheet -- Enzyme Inhibition Constant Data from BindingDB
Found 2 hits for monomerid = 50459737
TargetProtein ENL(Homo sapiens)
China Pharmaceutical University
Curated by ChEMBL
LigandPNGBDBM50459737(CHEMBL4211204)
Affinity DataKi:  101nM. Assay description: Displacement of N-Flu-DOT1L from MBP-tagged ENL (unknown origin) (489 to 559 residues) expressed in Escherichia coli BL21(DE3) measured after 3 hrs b...
Ligand InfoPC cidPC sid
In DepthDetails ArticlePubMed
TargetProtein ENL(Homo sapiens)
China Pharmaceutical University
Curated by ChEMBL
LigandPNGBDBM50459737(CHEMBL4211204)
Affinity DataIC50:  427nM. Assay description: Displacement of N-Flu-DOT1L from MBP-tagged ENL (unknown origin) (489 to 559 residues) expressed in Escherichia coli BL21(DE3) measured after 3 hrs b...
Ligand InfoPC cidPC sid
In DepthDetails ArticlePubMed